Neu aufsetzten bricht immer ab

Diskutiere Neu aufsetzten bricht immer ab im Win 10 -Installation Forum im Bereich Windows 10 Forum; Hallo, ich habe folgendes Problem: Ich will meinen Pc neu aufsetzten von win10 32 bit auf win10 64 bit. Ich habe die iso auf eine Cd gebrannt und...
I

ImTheZer0

Threadstarter
Mitglied seit
17.01.2016
Beiträge
6
Alter
24
Hallo, ich habe folgendes Problem:
Ich will meinen Pc neu aufsetzten von win10 32 bit auf win10 64 bit.
Ich habe die iso auf eine Cd gebrannt und versucht zu booten. Jedoch bricht der boot die ganze zeit ab. Das windows symbol läd eine kurze zeit dann startet der Pc neu. Nun habe ich mit dem windows Installationsprogramm einen bootfähigen USB stick erstellt jedoch selbes ergebniss: es läd eine kurze zeit dann startet der PC neu. Gelegentlich kommt das menü in dem man Tastatur und sprache auswählt danach klicke ich auf instalieren und wieder startet der pc neu.
Was kann ich machen damit es nicht die ganze zeit abbricht?
 
automatthias

automatthias

vernunftgeplagt
Mitglied seit
21.04.2006
Beiträge
8.040
Was ist das denn für eine Hardware? Kann die überhaupt 64 Bit?
 
I

ImTheZer0

Threadstarter
Mitglied seit
17.01.2016
Beiträge
6
Alter
24
Ja bei den computer Informationen steht ich habe einen x64 basierten Prozessor
 
M

mario95

Gast
Verstehe die erste frage nicht ganz.
Aktuell habe ich 32 bit und würde gerne mit 64 neu aufsetzten.
Vor dem update auf windows 10 habe ich in der vergangenheit mehrmals erfolgreich windows 7
32 bit installiert. Das ist jetzt das erste mal das so ein Fehler auftritt.
Iso für die CD war von der microsoft seite ebenso wie der usb stick automatisch
Von einem Microsoft programm erstellt wurde deshalb schließ ich da Fehler aus.
 
Bullayer

Bullayer

Schwergewicht
Mitglied seit
19.07.2006
Beiträge
24.151
Standort
DE-RLP-COC
BIOS / UEFI mal auf Standardeinstellungen zurückgesetzt?
 
Mike

Mike

i7-6700HQ
Team
Mitglied seit
21.09.2006
Beiträge
24.377
Standort
in der Nähe eines Rechners
Iso für die CD war von der microsoft seite ebenso wie der usb stick automatisch
Von einem Microsoft programm erstellt wurde deshalb schließ ich da Fehler aus.
Ich würde mir die ISO mit dem Mediacreation Tool runterladen bzw. einfach nochmals runterladen.
Persönlich verwende ich RUFUS zum Erstellen der Datenträger, da das M$-Tool doch schon 2-3 Fehler gemacht hat in der Vergangenheit.

Vor einer Neuinstallation das BIOS auf Standard zurücksetzen ist außerdem wirklich eine gute Idee :up
 
Alfiator

Alfiator

On Air
Mitglied seit
27.11.2008
Beiträge
21.306
Standort
Thüringen
Man wird hier geschleimt....:repect
 
M

mario95

Gast
Ich bin so langsam am verzweifeln.
Habe bereits einen usb stick mit dem Mediacreation Tool erstellt aber selbes Ergebnis. Dann dachte ich mir ich versuche es wieder mit 7. Hat soweit auch geklappt bis die Installation abgeschlossen war. Dann hängte es sich wieder auf und der pc startete neu. Jetzt habe ich zwar windows 7 drauf doch auch das bricht beim start immer ab und startet neu.
Danach noch mal neue iso runtergeladen und einen neuen stick erstellt mit win7 download tool. Selbes Ergebnis es fängt an das Installationsprogramm zu laden und dabei bricht es wieder ab. Bei mehreren versuchen komme ich gelegntlich soweit das ich auf windows instalieren klicken kann aber spätestend da ist dann wieder schluss und der pc startet neu.
Bios davor natürlich auf standart gesetzt
 
Mike

Mike

i7-6700HQ
Team
Mitglied seit
21.09.2006
Beiträge
24.377
Standort
in der Nähe eines Rechners
Also entweder hat der Rechner einen Hardwareschaden (RAM, CPU, .....) oder irgendwas anderes ist faul.

Eine komplette Neuinstallation (inkl. Löschen aller Partitionen, Zurücksetzen BIOS auf Standard etc.) muss ja normalerweise klappen :wacko

Als nächstes würde ich einmal den Speicher testen bzw. alles entfernen was für den normalen Betrieb nicht notwendig ist - falls etwas angeschlossen ist, was man nicht braucht.
Irgendwie muss man das ja eingrenzen können.
 
M

mario95

Gast
Ouh man hab des rätzels lösung.
Mein Pc scheint doch nicht 64 bit tauglich zu sein.
Habe nun erfolgreich 32 bit instaliert.
Wie ich darauf gekommen bin 64 bit zu instalieren?
Windows 10 hat hinter meiner betriebssystem Informaion ausgeschrieben das ich einen 64 bit basierten Prozessor habe. Da ich mich nicht sonderlich auskenne hatte ich zur sicherheit nochmal meine Systeminformationen in einem forum gepostet und gefragt ob mein System 64 bit tauglich ist.
Da alle Antworten positiv waren ging ich davon aus es müsse gehen.
Vielen dank für eure Antworten!

Wen es interessiert, hier ist besagte frage mit meinen system infos:
https://www.gutefrage.net/frage/ist-mein-alter-laptop-64-bit-tauglich?foundIn=notification-center
 
Hups

Hups

Katzennarr
Team
Mitglied seit
01.07.2007
Beiträge
18.380
Standort
D-NRW
Da hätte auch das 64bit funktionieren sollen.
 
I

ImTheZer0

Threadstarter
Mitglied seit
17.01.2016
Beiträge
6
Alter
24
Unbenannt.png
 
I

ImTheZer0

Threadstarter
Mitglied seit
17.01.2016
Beiträge
6
Alter
24
--- IPDT x86 - Revision: 3.0.0.25.W
--- IPDT x86 - Start Time: 12.07.2016 17:11:32

Intel(R) spbc Module Test
Module Version: 1.0.7.32b.W
Start Time: Tue Jul 12 17:11:33 2016
Test Result - PASS
..!!..Processor under test is verified as 'PRODUCTION'..!!..

Processor Manufacturer: GenuineIntel
Processor Brand String: Intel(R) Core(TM)2 Duo CPU P7450 @ 2.13GHz

End Time: Tue Jul 12 17:11:37 2016
Total Time: seconds: 4
--------------------------------------------------------------------
Genuine Intel CPU Test
Module Version: 1.0.12.32b.W
Start Time: Tue Jul 12 17:11:38 2016
Test Result - PASS
Expected: GenuineIntel
Detected: GenuineIntel
End Time: Tue Jul 12 17:11:38 2016
Total Time: seconds: 0
--------------------------------------------------------------------
Temperature Test
Module Version: 1.0.12.32b.W
Start Time: Tue Jul 12 17:11:38 2016
Test Result - PASS
Expected: Greater than 1 degrees below max
Received: 29 degrees below max
End Time: Tue Jul 12 17:11:43 2016
Total Time: seconds: 5
--------------------------------------------------------------------
CPU Brand String Test
Module Version: 1.0.12.32b.W
Start Time: Tue Jul 12 17:11:44 2016
Test Result - PASS
Expected String Parts: As Defined in BrandString_LocalConfig.xml
Detected: Intel(R) Core(TM)2 Duo CPU P7450 @ 2.13GHz
End Time: Tue Jul 12 17:11:44 2016
Total Time: seconds: 0
--------------------------------------------------------------------
CPU Frequency Test
Module Version: 1.0.14.32b.W
Start Time: Tue Jul 12 17:11:44 2016
Test Result - PASS
Processor Name: Intel(R) Core(TM)2 Duo CPU P7450 @ 2.13GHz
Expected CPU Frequency: 2.13
Detected CPU Frequency: 2.13096
This CPU does not support base clock
QPI link rate Test - Not supported.
Skipping QPI link rate Test.
End Time: Tue Jul 12 17:11:54 2016
Total Time: seconds: 10
--------------------------------------------------------------------
Floating Point Test
Module Version: 1.0.10.32b.W
Start Time: Tue Jul 12 17:11:54 2016
Test Result - PASS
Million Floating Points per Second, MFLOPS: 259.2
Error: 0
--- Floating Point Test Passed!!!---
End Time: Tue Jul 12 17:11:56 2016
Total Time: seconds: 2
--------------------------------------------------------------------
Prime Number Generation Test
Module Version: 1.0.10.32b.W
Start Time: Tue Jul 12 17:11:56 2016
Test Result - PASS
Operation Per Second: 1.32916e+006
Error: 0
--- Prime Number Generation Test Passed!!!---
End Time: Tue Jul 12 17:11:58 2016
Total Time: seconds: 2
--------------------------------------------------------------------
Cache Test
Module Version: 1.0.10.32b.W
Start Time: Tue Jul 12 17:11:58 2016
Test Result - PASS

--- Reading Cache Size ---

- Detected L1 Data Cache Size --> 32
- Detected L1 Inst Cache Size --> 32

- Detected L2 Cache Size --> 3072
- Detected L3 Cache Size --> Not Detected.

Cache Size Test Passed!!!

End Time: Tue Jul 12 17:11:58 2016
Total Time: seconds: 0
--------------------------------------------------------------------
MMXSSE Test
Module Version: 1.0.10.32b.W
Start Time: Tue Jul 12 17:11:58 2016
Test Result - PASS

--- Determining MMX - SSE capabilities ---
--- CPU FEATURES DETECTION FOR ---
--- MMX SSE ---
MMX - MMX Supported --> Yes
SSE - SSE Supported --> Yes
SSE2 - SSE2 Supported --> Yes
SSE3 - SSE3 Supported --> Yes
SSSE3 - SSSE3 Supported --> Yes
SSE4.1 - SSE4.1 Supported --> Yes
SSE4.2 - SSE4.2 Supported --> No
--- MMX SSE - capabilities check complete ---
MMX Test Result --- PASS
SSE Test Result --- PASS
SSE2 Test Result --- PASS
SSE3 Test Result --- PASS
SSSE3 Test Result --- PASS
SSE4.1 Test Result --- PASS
SSE4.2 Test Result --- Not Tested

End Time: Tue Jul 12 17:11:58 2016
Total Time: seconds: 0
--------------------------------------------------------------------
AVX Test
Module Version: 1.0.11.32b.W
Start Time: Tue Jul 12 17:11:59 2016
Test Result - PASS

--- Determining AVX AES PCLMULQDQ capabilities ---
--- CPU FEATURES DETECTION FOR ---
--- AVX/AES/PCLMULQDQ ---
AVX - Advanced Vector Extensions Supported --> No
AVX OS Support - AVX Operating System Supported --> No ---> No Test Required
AES - Advanced Encryption Standard Supported --> No ---> No Test Required
PCLMULQDQ - Polys Carry-Less Multiply Supported --> No ---> No Test Required
--- AVX AES PCLMULQDQ capabilities check complete ---
AVX Compare Test Result --- Not Tested
AES Test Result --- Not Tested
PCLMULQDQ Test Result --- Not Tested
No AVX AES PCLMULQDQ Tests required

End Time: Tue Jul 12 17:11:59 2016
Total Time: seconds: 0
--------------------------------------------------------------------
IMC Test
Module Version: 1.0.7.32b.W
Start Time: Tue Jul 12 17:11:59 2016
Test Result - PASS
--- Integrated Memory Controller Test NOT Supported on this Processor ---
..Skipping Integrated Memory Controller Test..
End Time: Tue Jul 12 17:11:59 2016
Total Time: seconds: 0
--------------------------------------------------------------------
PCH Test
Module Version: 1.0.9.32b.W
Start Time: Tue Jul 12 17:12:00 2016
Test Result - Config Mismatch
Platform Controller Hub Test not supported current chipset.
Skipping Platform Controller Hub Test.
End Time: Tue Jul 12 17:12:04 2016
Total Time: seconds: 4
--------------------------------------------------------------------
IGD Module Test
Module Version: 1.0.12.32b.W
Start Time: Tue Jul 12 17:12:05 2016
Test Result: Intel(R) Integrated Graphics Device Not Detected or Not Configured, Test Skipped
End Time: Tue Jul 12 17:12:09 2016
Total Time: seconds: 4
--------------------------------------------------------------------
GFX Module Test
Module Version: 1.0.12.32b.W
Start Time: Tue Jul 12 17:12:10 2016
GFX Module Test: PASS
End Time: Tue Jul 12 17:13:11 2016
Total Time: seconds: 61
--------------------------------------------------------------------
--- IPDT x86 - Temperature Monitor Results

--- Temperature Test ---
...
Version 1.0.12.32b.W
...

4 degrees C below maximum
Test Result - PASS
Expected Greater than 1 degrees below max
Received 4 degrees below max

--- Temperature Test ---
...
Version 1.0.12.32b.W
...


Entering run forever
4 degrees C below maximum
Test Result - PASS
Expected Greater than 1 degrees below max
Received 4 degrees below max
Test PASSED
4 degrees C below maximum
Test Result - PASS
Expected Greater than 1 degrees below max
Received 4 degrees below max
Test PASSED
3 degrees C below maximum
Test Result - PASS
Expected Greater than 1 degrees below max
Received 3 degrees below max
Test PASSED
3 degrees C below maximum
Test Result - PASS
Expected Greater than 1 degrees below max
Received 3 degrees below max
Test PASSED
2 degrees C below maximum
Test Result - PASS
Expected Greater than 1 degrees below max
Received 2 degrees below max
Test PASSED
2 degrees C below maximum
Test Result - PASS
Expected Greater than 1 degrees below max
Received 2 degrees below max
Test PASSED
3 degrees C below maximum
Test Result - PASS
Expected Greater than 1 degrees below max
Received 3 degrees below max
Test PASSED
3 degrees C below maximum
Test Result - PASS
Expected Greater than 1 degrees below max
Received 3 degrees below max
Test PASSED
4 degrees C below maximum
Test Result - PASS
Expected Greater than 1 degrees below max
Received 4 degrees below max
Test PASSED
4 degrees C below maximum
Test Result - PASS
Expected Greater than 1 degrees below max
Received 4 degrees below max
Test PASSED
3 degrees C below maximum
Test Result - PASS
Expected Greater than 1 degrees below max
Received 3 degrees below max
Test PASSED
3 degrees C below maximum
Test Result - PASS
Expected Greater than 1 degrees below max
Received 3 degrees below max
Test PASSED
4 degrees C below maximum
Test Result - PASS
Expected Greater than 1 degrees below max
Received 4 degrees below max
Test PASSED
2 degrees C below maximum
Test Result - PASS
Expected Greater than 1 degrees below max
Received 2 degrees below max
Test PASSED
3 degrees C below maximum
Test Result - PASS
Expected Greater than 1 degrees below max
Received 3 degrees below max
Test PASSED
2 degrees C below maximum
Test Result - PASS
Expected Greater than 1 degrees below max
Received 2 degrees below max
Test PASSED
2 degrees C below maximum
Test Result - PASS
Expected Greater than 1 degrees below max
Received 2 degrees below max
Test PASSED
2 degrees C below maximum
Test Result - PASS
Expected Greater than 1 degrees below max
Received 2 degrees below max
Test PASSED
2 degrees C below maximum
Test Result - PASS
Expected Greater than 1 degrees below max
Received 2 degrees below max
Test PASSED
3 degrees C below maximum
Test Result - PASS
Expected Greater than 1 degrees below max
Received 3 degrees below max
Test PASSED
2 degrees C below maximum
Test Result - PASS
Expected Greater than 1 degrees below max
Received 2 degrees below max
Test PASSED
2 degrees C below maximum
Test Result - PASS
Expected Greater than 1 degrees below max
Received 2 degrees below max
Test PASSED
2 degrees C below maximum
Test Result - PASS
Expected Greater than 1 degrees below max
Received 2 degrees below max
Test PASSED
2 degrees C below maximum
Test Result - PASS
Expected Greater than 1 degrees below max
Received 2 degrees below max
Test PASSED
2 degrees C below maximum
Test Result - PASS
Expected Greater than 1 degrees below max
Received 2 degrees below max
Test PASSED
1 degrees C below maximum
Test Result - FAIL
Expected Greater than 1 degrees below max
Received 1 degrees below max
Test FAILED
Please check your Processor Thermal Solution
Temperature Monitor Stopped

--------------------------------------------------------------------
System Information
------------------
Processor Name: Intel(R) Core(TM)2 Duo CPU P7450 @ 2.13GHz
Processor Information: x64 Family 6 Model 23 Stepping 6
Number of Physical Cores: 2
Number of Logical Cores: 2
Installed System Memory: 4 GB
Operating System: Microsoft Windows 7 Professional 32-Bit
Graphics Information: NVIDIA GeForce 9300M GS
System Product: F47
System BIOS: 1.07C
--------------------------------------------------------------------

--- IPDT x86 - End Time: 12.07.2016 17:16:35
--- IPDT x86 - Result: Fail
--------------------------------------------------------------------
--- IPDT x86 - Temperature Monitor Results

--- Temperature Test ---
...
Version 1.0.12.32b.W
...

4 degrees C below maximum
Test Result - PASS
Expected Greater than 1 degrees below max
Received 4 degrees below max

--- Temperature Test ---
...
Version 1.0.12.32b.W
...


Entering run forever
4 degrees C below maximum
Test Result - PASS
Expected Greater than 1 degrees below max
Received 4 degrees below max
Test PASSED
4 degrees C below maximum
Test Result - PASS
Expected Greater than 1 degrees below max
Received 4 degrees below max
Test PASSED
3 degrees C below maximum
Test Result - PASS
Expected Greater than 1 degrees below max
Received 3 degrees below max
Test PASSED
3 degrees C below maximum
Test Result - PASS
Expected Greater than 1 degrees below max
Received 3 degrees below max
Test PASSED
2 degrees C below maximum
Test Result - PASS
Expected Greater than 1 degrees below max
Received 2 degrees below max
Test PASSED
2 degrees C below maximum
Test Result - PASS
Expected Greater than 1 degrees below max
Received 2 degrees below max
Test PASSED
3 degrees C below maximum
Test Result - PASS
Expected Greater than 1 degrees below max
Received 3 degrees below max
Test PASSED
3 degrees C below maximum
Test Result - PASS
Expected Greater than 1 degrees below max
Received 3 degrees below max
Test PASSED
4 degrees C below maximum
Test Result - PASS
Expected Greater than 1 degrees below max
Received 4 degrees below max
Test PASSED
4 degrees C below maximum
Test Result - PASS
Expected Greater than 1 degrees below max
Received 4 degrees below max
Test PASSED
3 degrees C below maximum
Test Result - PASS
Expected Greater than 1 degrees below max
Received 3 degrees below max
Test PASSED
3 degrees C below maximum
Test Result - PASS
Expected Greater than 1 degrees below max
Received 3 degrees below max
Test PASSED
4 degrees C below maximum
Test Result - PASS
Expected Greater than 1 degrees below max
Received 4 degrees below max
Test PASSED
2 degrees C below maximum
Test Result - PASS
Expected Greater than 1 degrees below max
Received 2 degrees below max
Test PASSED
3 degrees C below maximum
Test Result - PASS
Expected Greater than 1 degrees below max
Received 3 degrees below max
Test PASSED
2 degrees C below maximum
Test Result - PASS
Expected Greater than 1 degrees below max
Received 2 degrees below max
Test PASSED
2 degrees C below maximum
Test Result - PASS
Expected Greater than 1 degrees below max
Received 2 degrees below max
Test PASSED
2 degrees C below maximum
Test Result - PASS
Expected Greater than 1 degrees below max
Received 2 degrees below max
Test PASSED
2 degrees C below maximum
Test Result - PASS
Expected Greater than 1 degrees below max
Received 2 degrees below max
Test PASSED
3 degrees C below maximum
Test Result - PASS
Expected Greater than 1 degrees below max
Received 3 degrees below max
Test PASSED
2 degrees C below maximum
Test Result - PASS
Expected Greater than 1 degrees below max
Received 2 degrees below max
Test PASSED
2 degrees C below maximum
Test Result - PASS
Expected Greater than 1 degrees below max
Received 2 degrees below max
Test PASSED
2 degrees C below maximum
Test Result - PASS
Expected Greater than 1 degrees below max
Received 2 degrees below max
Test PASSED
2 degrees C below maximum
Test Result - PASS
Expected Greater than 1 degrees below max
Received 2 degrees below max
Test PASSED
2 degrees C below maximum
Test Result - PASS
Expected Greater than 1 degrees below max
Received 2 degrees below max
Test PASSED
1 degrees C below maximum
Test Result - FAIL
Expected Greater than 1 degrees below max
Received 1 degrees below max
Test FAILED
Please check your Processor Thermal Solution
Temperature Monitor Stopped

--------------------------------------------------------------------
System Information
------------------
Processor Name: Intel(R) Core(TM)2 Duo CPU P7450 @ 2.13GHz
Processor Information: x64 Family 6 Model 23 Stepping 6
Number of Physical Cores: 2
Number of Logical Cores: 2
Installed System Memory: 4 GB
Operating System: Microsoft Windows 7 Professional 32-Bit
Graphics Information: NVIDIA GeForce 9300M GS
System Product: F47
System BIOS: 1.07C
--------------------------------------------------------------------

--- IPDT x86 - End Time: 12.07.2016 17:16:36
--- IPDT x86 - Result: Fail
--------------------------------------------------------------------
Module - CPULoad.exe did not create a results file.
CPULoad.exe Exit Code = -1
--------------------------------------------------------------------
--- IPDT x86 - Temperature Monitor Results

--- Temperature Test ---
...
Version 1.0.12.32b.W
...

4 degrees C below maximum
Test Result - PASS
Expected Greater than 1 degrees below max
Received 4 degrees below max

--- Temperature Test ---
...
Version 1.0.12.32b.W
...


Entering run forever
4 degrees C below maximum
Test Result - PASS
Expected Greater than 1 degrees below max
Received 4 degrees below max
Test PASSED
4 degrees C below maximum
Test Result - PASS
Expected Greater than 1 degrees below max
Received 4 degrees below max
Test PASSED
3 degrees C below maximum
Test Result - PASS
Expected Greater than 1 degrees below max
Received 3 degrees below max
Test PASSED
3 degrees C below maximum
Test Result - PASS
Expected Greater than 1 degrees below max
Received 3 degrees below max
Test PASSED
2 degrees C below maximum
Test Result - PASS
Expected Greater than 1 degrees below max
Received 2 degrees below max
Test PASSED
2 degrees C below maximum
Test Result - PASS
Expected Greater than 1 degrees below max
Received 2 degrees below max
Test PASSED
3 degrees C below maximum
Test Result - PASS
Expected Greater than 1 degrees below max
Received 3 degrees below max
Test PASSED
3 degrees C below maximum
Test Result - PASS
Expected Greater than 1 degrees below max
Received 3 degrees below max
Test PASSED
4 degrees C below maximum
Test Result - PASS
Expected Greater than 1 degrees below max
Received 4 degrees below max
Test PASSED
4 degrees C below maximum
Test Result - PASS
Expected Greater than 1 degrees below max
Received 4 degrees below max
Test PASSED
3 degrees C below maximum
Test Result - PASS
Expected Greater than 1 degrees below max
Received 3 degrees below max
Test PASSED
3 degrees C below maximum
Test Result - PASS
Expected Greater than 1 degrees below max
Received 3 degrees below max
Test PASSED
4 degrees C below maximum
Test Result - PASS
Expected Greater than 1 degrees below max
Received 4 degrees below max
Test PASSED
2 degrees C below maximum
Test Result - PASS
Expected Greater than 1 degrees below max
Received 2 degrees below max
Test PASSED
3 degrees C below maximum
Test Result - PASS
Expected Greater than 1 degrees below max
Received 3 degrees below max
Test PASSED
2 degrees C below maximum
Test Result - PASS
Expected Greater than 1 degrees below max
Received 2 degrees below max
Test PASSED
2 degrees C below maximum
Test Result - PASS
Expected Greater than 1 degrees below max
Received 2 degrees below max
Test PASSED
2 degrees C below maximum
Test Result - PASS
Expected Greater than 1 degrees below max
Received 2 degrees below max
Test PASSED
2 degrees C below maximum
Test Result - PASS
Expected Greater than 1 degrees below max
Received 2 degrees below max
Test PASSED
3 degrees C below maximum
Test Result - PASS
Expected Greater than 1 degrees below max
Received 3 degrees below max
Test PASSED
2 degrees C below maximum
Test Result - PASS
Expected Greater than 1 degrees below max
Received 2 degrees below max
Test PASSED
2 degrees C below maximum
Test Result - PASS
Expected Greater than 1 degrees below max
Received 2 degrees below max
Test PASSED
2 degrees C below maximum
Test Result - PASS
Expected Greater than 1 degrees below max
Received 2 degrees below max
Test PASSED
2 degrees C below maximum
Test Result - PASS
Expected Greater than 1 degrees below max
Received 2 degrees below max
Test PASSED
2 degrees C below maximum
Test Result - PASS
Expected Greater than 1 degrees below max
Received 2 degrees below max
Test PASSED
1 degrees C below maximum
Test Result - FAIL
Expected Greater than 1 degrees below max
Received 1 degrees below max
Test FAILED
Please check your Processor Thermal Solution
Temperature Monitor Stopped

--------------------------------------------------------------------
System Information
------------------
Processor Name: Intel(R) Core(TM)2 Duo CPU P7450 @ 2.13GHz
Processor Information: x64 Family 6 Model 23 Stepping 6
Number of Physical Cores: 2
Number of Logical Cores: 2
Installed System Memory: 4 GB
Operating System: Microsoft Windows 7 Professional 32-Bit
Graphics Information: NVIDIA GeForce 9300M GS
System Product: F47
System BIOS: 1.07C
--------------------------------------------------------------------

--- IPDT x86 - End Time: 12.07.2016 17:16:37
--- IPDT x86 - Result: Fail
--------------------------------------------------------------------
FAIL
 
Thema:

Neu aufsetzten bricht immer ab

Sucheingaben

windows 10 installation bricht ab

Neu aufsetzten bricht immer ab - Ähnliche Themen

  • Windows 8.1 neu aufsetzten

    Windows 8.1 neu aufsetzten: Hallo Community, Folgendes Problem: Ich habe mir vor einiger Zeit einen neuen Laptop mit vorinstalliertem Windows 8 zugelegt, dann upgrade auf...
  • Neu aufsetzten eines Sony Notebooks

    Neu aufsetzten eines Sony Notebooks: Ich möchte die Festplatte komplett formatieren. Nach dem Zurücksetzten waren immer noch Datenreste vorhanden. Ich bin mir jedoch nicht sicher, ob...
  • Windows neu aufsetzten

    Windows neu aufsetzten: Ich wolte Windows neu Aufsetzen.(Window 8.1 64 Bit) Doch dea MediaCreationTool gibt mir immer nur den fehler aus: Der Download wurde nicht...
  • Kann der Comuputer noch gehackt sein wenn man ihn neu aufsetzt?

    Kann der Comuputer noch gehackt sein wenn man ihn neu aufsetzt?: Hallo, Ich habe mal eine Frage, Wenn ich meinen pc neu aufsetzte kann mein Computer dann noch gehackt sein? Ich habe jetzt denn fall das ich...
  • Windows 10 neu aufsetzten

    Windows 10 neu aufsetzten: Liebe Community Mein Laptop ist nun schon etliche Jahre alt und zugemüllt mit allem möglichen. Entsprechend langsam ist er auch geworden...
  • Ähnliche Themen

    • Windows 8.1 neu aufsetzten

      Windows 8.1 neu aufsetzten: Hallo Community, Folgendes Problem: Ich habe mir vor einiger Zeit einen neuen Laptop mit vorinstalliertem Windows 8 zugelegt, dann upgrade auf...
    • Neu aufsetzten eines Sony Notebooks

      Neu aufsetzten eines Sony Notebooks: Ich möchte die Festplatte komplett formatieren. Nach dem Zurücksetzten waren immer noch Datenreste vorhanden. Ich bin mir jedoch nicht sicher, ob...
    • Windows neu aufsetzten

      Windows neu aufsetzten: Ich wolte Windows neu Aufsetzen.(Window 8.1 64 Bit) Doch dea MediaCreationTool gibt mir immer nur den fehler aus: Der Download wurde nicht...
    • Kann der Comuputer noch gehackt sein wenn man ihn neu aufsetzt?

      Kann der Comuputer noch gehackt sein wenn man ihn neu aufsetzt?: Hallo, Ich habe mal eine Frage, Wenn ich meinen pc neu aufsetzte kann mein Computer dann noch gehackt sein? Ich habe jetzt denn fall das ich...
    • Windows 10 neu aufsetzten

      Windows 10 neu aufsetzten: Liebe Community Mein Laptop ist nun schon etliche Jahre alt und zugemüllt mit allem möglichen. Entsprechend langsam ist er auch geworden...
    Oben